4AFvkF6D : autoinsuranceabc.xyz

> Accueil > Annuaire > HABITAT / NRJ NOUVELLES > ECO EQUIPEMENTS > 4AFvkF6D : autoinsuranceabc.xyz

  

4AFvkF6D

4AFvkF6D
I have tried your code which is downloaded from and built in my Ubuntu 12.04 and using OpenCV2.4But, I got an error like :”[22%] Built target freenect[22%] Built target freenect_syncLinking C shared library ../../../../lib/libfreenect_cv.so/usr/bin/ld: cannot find -lcvcollect2: ld returned 1 exit statusmake[2]: *** [lib/libfreenect_cv.so.0.0.1] Error 1make[1]: *** [include/libfreenect/wrappers/opencv/CMakeFiles/freenect_cv.dir/all] Error 2make: *** [all] Error 2”Have tried with other PC , but still got the same result as aboveIs there any suggestion to solve this problem ?
I have tried your code which is downloaded from and built in my Ubuntu 12.04 and using OpenCV2.4But, I got an error like :”[22%] Built target freenect[22%] Built target freenect_syncLinking C shared library ../../../../lib/libfreenect_cv.so/usr/bin/ld: cannot find -lcvcollect2: ld returned 1 exit statusmake[2]: *** [lib/libfreenect_cv.so.0.0.1] Error 1make[1]: *** [include/libfreenect/wrappers/opencv/CMakeFiles/freenect_cv.dir/all] Error 2make: *** [all] Error 2”Have tried with other PC , but still got the same result as aboveIs there any suggestion to solve this problem ?
  
  

Publicités